{"text_format":"1","workbook":"xlsx","n_sheets":31,"sheets":["NatC Tumbling arrière","NatC Tumbling Mixte","NatC Tumbling avant","ListeClubAvril2023","FFGym Clubs","FedB Tumbling avant","FedB Tumbling arrière","NatB Tumbling Mixte","NatC MT - MT","NatC MT - Saut","FedB MT - MT","FedA Tumbling avant","FedA Tumbling arrière","NatB Tumbling avant","NatB Tumbling arrière","FedA MT - MT","NatB MT - Saut","ListeDiffSol","NatB MT - MT","ListeClubs 95 ","liste","Activer Macro 97-2003","Activer Macro2007","SOL Explications","Explications","MessageErreurO365","fiche engagement","FED Dif Sol","PERF Dif Sol","dif tumbling","dif mini tramp"],"not_rendered":{"charts":0,"images":23,"macros":1,"external_links":1,"defined_names":66,"comments":0,"pivot_tables":0},"unopened":[],"bounds":{"document_bytes":16777216,"sheet_cells":100000,"rows_first":2000,"rows_last":500,"rows_between":2000,"halvings":0,"cell_chars":16384,"cell_head_chars":4096},"cells_cut":0,"cells_raw":0,"read":"whole","date_system":"1900"}

{"sheet":"NatC Tumbling arrière","index":0,"n_rows":44,"n_cols":4,"rows_kept":44,"cut":false,"hidden":true,"merged":[[0,0,0,2],[2,0,16,0],[17,0,37,0],[38,0,42,0],[43,0,50,0]]}
["Séries autorisée au Tumbling en arrière\nTeamGym",null,null,{"$f":"COUNTA(B3:B29)","v":27}]
[null,"Séries","Valeur"]
[null,"Saut de mains 1 pied Roue ",0.5]
[null,"Saut de mains 1 pied Rondade",0.5]
[null,"Roue Roue pied pied ",0.5]
[null,"Roue saut de mains ",0.5]
{"$rows_left_out":39}
{"sheet":"NatC Tumbling Mixte","index":1,"n_rows":48,"n_cols":4,"rows_kept":48,"cut":false,"hidden":true,"merged":[[0,0,0,2],[2,0,16,0],[17,0,33,0],[34,0,38,0],[39,0,51,0]]}
["Séries autorisée au Tumbling en arrière\nTeamGym",null,null,{"$f":"COUNTA(B3:B48)","v":46}]
[null,"Séries","Valeur"]
[null,"Roue Rondade",0.5]
[null,"Saut de mains 1 pied Roue ",0.5]
[null,"Saut de mains 1 pied Rondade",0.5]
[null,"Roue Roue pied pied ",0.5]
{"$rows_left_out":43}
{"sheet":"NatC Tumbling avant","index":2,"n_rows":57,"n_cols":4,"rows_kept":57,"cut":false,"hidden":true,"merged":[[0,0,0,2],[2,0,31,0],[33,0,55,0],[56,0,67,0],[68,0,69,0]]}
["Séries autorisées au Tumbling en avant\nTeamGym",null,null,{"$f":"COUNTA(SerieAvantTumblingNatC)","v":20}]
[null,"Séries","Valeur"]
[null,"Roue Rondade",0.5]
[null,"Saut de mains 1 pied Roue",1]
[null,"Saut de mains 1 pied Rondade",1]
[null,"Saut de mains 1 pied Saut de mains",1]
{"$rows_left_out":52}
{"sheet":"ListeClubAvril2023","index":3,"n_rows":298,"n_cols":4,"rows_kept":298,"cut":false,"hidden":true,"merged":[]}
["Nom","Numéro d'affiliation","Ville"]
["A S C A","52072.054","LA CHAPELLE ST-AUBIN",{"$f":"VLOOKUP(A2,'FFGym Clubs'!A:A,1,FALSE)","v":"A S C A"}]
["A S COURONNAISE ","28076.027","PETIT COURONNE",{"$f":"VLOOKUP(A3,'FFGym Clubs'!A:A,1,FALSE)","v":"A S COURONNAISE "}]
["A.N.T. AVIGNON","93084.033","AVIGNON",{"$f":"VLOOKUP(A4,'FFGym Clubs'!A:A,1,FALSE)","v":"A.N.T. AVIGNON"}]
["A.S.P.C. GYM'SPORT","52049.082","LES PONTS DE CE",{"$f":"VLOOKUP(A5,'FFGym Clubs'!A:A,1,FALSE)","v":"A.S.P.C. GYM'SPORT"}]
["ABBEVILLE GYM","32080.065","ABBEVILLE",{"$f":"VLOOKUP(A6,'FFGym Clubs'!A:A,1,FALSE)","v":"ABBEVILLE GYM"}]
{"$rows_left_out":293}
{"sheet":"FFGym Clubs","index":4,"n_rows":381,"n_cols":5,"rows_kept":381,"cut":false,"hidden":false,"merged":[]}
["Nom","Number","Numéro d'affiliation","Abréviation","Ville"]
[null,0]
["1-CLUB INTROUVABLE ",1,"00000.000","INCONNU","INCONNUE"]
["A S C A",2,"52072.054","A S C A","LA CHAPELLE ST-AUBIN"]
["A S COURONNAISE ",3,"28076.027","A.S.C.G PETIT COURONNE ","PETIT COURONNE"]
["A.N.T. AVIGNON",4,"93084.033","A.N.T. AVIGNON","AVIGNON"]
{"$rows_left_out":376}
{"sheet":"FedB Tumbling avant","index":5,"n_rows":11,"n_cols":4,"rows_kept":11,"cut":false,"hidden":true,"merged":[[0,0,0,2],[2,0,8,0],[9,0,12,0]]}
["Séries autorisées au Tumbling en avant\nTeamGym",null,null,{"$f":"COUNTA(SerieArriereTumblingFedB)","v":10}]
[null,"Séries","Valeur"]
[null,"Roulade avant",0.5]
[null,"Roue",1]
[null,"Roue saut de mains",2]
[null,"Saut de mains",2]
{"$rows_left_out":6}
{"sheet":"FedB Tumbling arrière","index":6,"n_rows":42,"n_cols":8,"rows_kept":42,"cut":false,"hidden":true,"merged":[[0,0,0,2],[2,0,4,0],[5,0,11,0]]}
["Séries autorisée au Tumbling en arrière\nTeamGym",null,null,{"$f":"COUNTA(SerieArriereTumblingFedB)","v":10}]
[null,"Séries","Valeur"]
[null,"Roue",1]
[null,"Roue pied pied",1]
[null,"Roue Roue pied pied",1]
[null,"Roue saut de mains",1]
{"$rows_left_out":37}
{"sheet":"NatB Tumbling Mixte","index":7,"n_rows":125,"n_cols":3,"rows_kept":125,"cut":false,"hidden":true,"merged":[[0,0,0,2],[2,0,17,0],[18,0,34,0],[35,0,39,0],[40,0,52,0]]}
["Séries autorisée au Tumbling en arrière\nTeamGym"]
[null,"Séries","Valeur"]
[null,"Série Nulle ",0]
[null,"Saut de mains 1 pied Roue ",0.5]
[null,"Saut de mains 1 pied Rondade",0.5]
[null,"Roue Roue pied pied ",0.5]
{"$rows_left_out":120}
{"sheet":"NatC MT - MT","index":8,"n_rows":11,"n_cols":4,"rows_kept":11,"cut":false,"hidden":true,"merged":[[0,0,0,2],[2,0,15,0]]}
["Séries autorisées au Mini Trampoline et Table de Saut\nTeamGym",null,null,{"$f":"COUNTA(SerieMTMTNatC)","v":9}]
[null,"Eléments","Valeur"]
[null,"Saut carpé ecart ",1]
[null,"Saut carpé ecart 1/2 tour ",1.2]
[null,"Salto av groupé ",1.4]
[null,"Salto av carpé ",1.5]
{"$rows_left_out":6}
{"sheet":"NatC MT - Saut","index":9,"n_rows":6,"n_cols":4,"rows_kept":6,"cut":false,"hidden":true,"merged":[[0,0,0,2],[2,0,7,0]]}
["Séries autorisées au Mini Trampoline et Table de Saut\nTeamGym",null,null,{"$f":"COUNTA(SerieMTMTNatC)","v":9}]
[null,"Eléments","Valeur"]
[null,"Rondade ",1]
[null,"Rondade 1/2 tour - Pétrick (180°/180°) ",1.2]
[null,"Lune ",1.6]
[null,"Saut Nul",0]
{"$rows_left_out":1}
{"sheet":"FedB MT - MT","index":10,"n_rows":11,"n_cols":4,"rows_kept":11,"cut":false,"hidden":true,"merged":[[0,0,0,2],[2,0,11,0]]}
["Séries autorisées au Mini Trampoline et Table de Saut\nTeamGym",null,null,{"$f":"COUNTA(SerieArriereTumblingFedB)","v":10}]
[null,"Eléments","Valeur "]
[null,"Saut droit",1.2]
[null,"Saut droit 1/2 tour",1.4]
[null,"Saut droit 1 tour",1.6]
[null,"Saut groupé",1.5]
{"$rows_left_out":6}
{"sheet":"FedA Tumbling avant","index":11,"n_rows":14,"n_cols":5,"rows_kept":14,"cut":false,"hidden":true,"merged":[[9,0,10,0],[0,0,0,2],[2,0,8,0]]}
["Séries autorisées au Tumbling en avant\nTeamGym",null,null,null,{"$f":"COUNTA(B3:B14)","v":12}]
[null,"Séries","Valeur"]
[null,"Roulade avant",0.3]
[null,"Roue",0.5]
[null,"Roue Rondade",0.5]
[null,"Roue Roue pied pied",0.5]
{"$rows_left_out":9}
{"sheet":"FedA Tumbling arrière","index":12,"n_rows":41,"n_cols":8,"rows_kept":41,"cut":false,"hidden":true,"merged":[[5,0,10,0],[0,0,0,2],[2,0,4,0]]}
["Séries autorisée au Tumbling en arrière\nTeamGym",null,null,{"$f":"COUNTA(SerieArriereTumblingFedA)","v":11}]
[null,"Séries","Valeur"]
[null,"Roue",0.5]
[null,"Roue pied pied",0.5]
[null,"Roue Roue pied pied",0.5]
[null,"Roue saut de mains",0.5]
{"$rows_left_out":36}
{"sheet":"NatB Tumbling avant","index":13,"n_rows":74,"n_cols":3,"rows_kept":74,"cut":false,"hidden":true,"merged":[[0,0,0,2],[2,0,32,0],[34,0,56,0],[57,0,68,0],[69,0,70,0]]}
["Séries autorisées au Tumbling en avant\nTeamGym"]
[null,"Séries","Valeur"]
[null,"Série Nulle ",0]
[null,"Roue Rondade",0.5]
[null,"Roue Roue pied pied",0.5]
[null,"Roue saut de mains",1]
{"$rows_left_out":69}
{"sheet":"NatB Tumbling arrière","index":14,"n_rows":55,"n_cols":3,"rows_kept":55,"cut":false,"hidden":true,"merged":[[2,0,17,0],[18,0,38,0],[39,0,43,0],[44,0,51,0],[0,0,0,2]]}
["Séries autorisée au Tumbling en arrière\nTeamGym"]
[null,"Séries","Valeur"]
["2 éléments","Série Nulle",0]
[null,"Roue Rondade ",0.5]
[null,"Roue Roue pied pied ",0.5]
[null,"Roue saut de mains ",0.5]
{"$rows_left_out":50}
{"sheet":"FedA MT - MT","index":15,"n_rows":13,"n_cols":4,"rows_kept":13,"cut":false,"hidden":true,"merged":[[0,0,0,2],[2,0,9,0]]}
["Séries autorisées au Mini Trampoline et Table de Saut\nTeamGym",null,null,{"$f":"COUNTA(SerieMTMTFedA)","v":11}]
[null,"Eléments","Valeur "]
[null,"Saut groupé",1]
[null,"Saut droit",1]
[null,"Saut droit 1/2 tour",1.2]
[null,"Saut carpé serré",1.3]
{"$rows_left_out":8}
{"sheet":"NatB MT - Saut","index":16,"n_rows":8,"n_cols":5,"rows_kept":8,"cut":false,"hidden":true,"merged":[[2,0,8,0],[0,0,0,2]]}
["Séries autorisées au Mini Trampoline et Table de Saut\nTeamGym",null,null,null,{"$f":"COUNTA(B3:B8)","v":6}]
[null,"Eléments","Valeur"]
[null,"Rondade ",1]
[null,"Rondade 1/2 tour - Pétrick (180°/180°) ",1.2]
[null,"Lune ",1.6]
[null,"Lune 1/2 tour ",1.8]
{"$rows_left_out":3}
{"sheet":"ListeDiffSol","index":17,"n_rows":190,"n_cols":12,"rows_kept":190,"cut":false,"hidden":true,"merged":[[0,5,0,9],[0,0,0,4]]}
["Fédérale",null,null,null,null,"Performance"]
[{"$f":"COUNTA(A5:A27)","v":23},{"$f":"COUNTA(B5:B28)","v":6},{"$f":"COUNTA(C5:C29)","v":15},{"$f":"COUNTA(D5:D28)","v":24},1,24,{"$f":"COUNTA(G5:G64)","v":60},{"$f":"COUNTA(H5:H23)","v":19},{"$f":"COUNTA(I5:I27)","v":23},24,{"$f":"COUNTA(K5:K26)","v":4},{"$f":"COUNTA(L5:L18)","v":14}]
["FEDSAUT","FEDPIVOTS","FEDMAINTIEN","FEDTOUT","FEDGE","PERFCOMBI","PERFSAUT","PERFPIVOTS","PERFMAINTIENT","PERFMIXTE","PERFGE","PERFACRO"]
[]
["J201","DB201","SB204","J201","G401","J201","J201","DB201","SB204","J201","G401","A205"]
["J202","DB202","SB206","J202",null,"J202","J202","DB202","SB402","J202","G802","A209"]
{"$rows_left_out":185}
{"sheet":"NatB MT - MT","index":18,"n_rows":15,"n_cols":4,"rows_kept":15,"cut":false,"hidden":true,"merged":[[0,0,0,2],[2,0,15,0]]}
["Séries autorisées au Mini Trampoline et Table de Saut\nTeamGym",null,null,{"$f":"COUNTA(SerieMTMTNatB)","v":13}]
[null,"Eléments","Valeur"]
[null,"Saut carpé ecart ",1]
[null,"Saut carpé ecart 1/2 tour ",1.2]
[null,"Salto av groupé ",1.4]
[null,"Salto av carpé ",1.5]
{"$rows_left_out":10}
{"sheet":"ListeClubs 95 ","index":19,"n_rows":191,"n_cols":6,"rows_kept":191,"cut":false,"hidden":true,"merged":[]}
["Nom","Numéro d'affiliation","Abréviation","Région","Département","Ville"]
["UNION KOENIGSHOFFEN","01067.077","UNION KOENIGSHOFFEN","ALSACE","BAS RHIN","KOENIGSHOFFEN"]
["SOCIETE DE GYMNASTIQUE MASEVAUX","01068.039","S.G. MASEVAUX","ALSACE","HAUT RHIN","MASEVAUX"]
["SOCIETE DE GYMNASTIQUE SAUSHEIM","01068.054","S.G. SAUSHEIM","ALSACE","HAUT RHIN","SAUSHEIM"]
["EAST FRANCE TEAMGYM","01068.154",null,"ALSACE","HAUT RHIN","RIBEAUVILLE"]
["L'UNION SPORTIVE TALENCAISE","02033.004","L'US TALENCE","AQUITAINE","GIRONDE","TALENCE"]
{"$rows_left_out":186}
{"sheet":"liste","index":20,"n_rows":21,"n_cols":13,"rows_kept":21,"cut":false,"hidden":true,"merged":[]}
[]
["FédéralA",1,null,"Finale A","Junior",1]
["FédéralB",1,"Adulte","Finale B","Senior",2,null,"FédéralA","FédéralB","NationalA","NationalB","NationalC","Europe"]
["FédéralC",2,"Féminine","Finale C",null,3,null,"Adultes","Adultes","Junior ","Mix-Masc","Junior","Senior Féminine"]
["NationalA",2,"Masc/Mix","Finale D",null,4,null,"Mix-Masc","Mix-Masc","12 ans et Plus","Fem","12 ans et Plus","Senior Masculine"]
["NationalB",2,"Unique",null,null,null,null,"Fem","Fem",null,"Junior",null,"Senior Mixte"]
{"$rows_left_out":16}
{"sheet":"Activer Macro 97-2003","index":21,"n_rows":71,"n_cols":1,"rows_kept":71,"cut":false,"hidden":false,"merged":[]}
["pour activer les macros :"]
[]
["en résumé : menu Excel ->"]
["Outils > Macros > Sécurité > cocher niveau sécurité moyen"]
[]
["en images:"]
{"$rows_left_out":66}
{"sheet":"Activer Macro2007","index":22,"n_rows":30,"n_cols":2,"rows_kept":30,"cut":false,"hidden":false,"merged":[]}
[]
[]
[]
[]
[]
[]
{"$rows_left_out":25}
{"sheet":"SOL Explications","index":23,"n_rows":22,"n_cols":9,"rows_kept":22,"cut":false,"hidden":false,"merged":[[21,5,28,7],[17,1,18,4],[17,8,18,11],[0,1,0,11],[1,1,1,11],[2,1,2,11]]}
[null,"FEUILLES DE DIFF SOL - \n"]
[null,"La feuille a été modifiée pour que les juges de composition voit les données pour mieux juger. Sur cette page vous avez tout pour construire votre sol."]
[null,"Sélectionnez les objets et déplacez les sur les carrés blancs pour contruire votre formation et/ou indiquez les exigences de composition."]
[]
[]
[]
{"$rows_left_out":17}
{"sheet":"Explications","index":24,"n_rows":49,"n_cols":4,"rows_kept":49,"cut":false,"hidden":false,"merged":[[1,3,2,9],[3,3,3,9],[5,1,5,10],[6,1,6,10],[7,1,7,11],[24,1,24,10],[8,1,8,11],[9,1,9,10],[10,1,10,10],[12,1,12,10],[14,1,14,10],[16,1,16,10],[17,1,17,10],[19,1,19,10],[21,1,21,10],[22,1,22,10],[23,1,23,10],[41,1,41,10],[43,1,43,10],[44,1,44,10],[25,1,25,10],[26,1,26,10],[29,1,29,10],[33,1,33,10],[34,1,34,10],[36,1,36,10]]}
[]
[null,null,null,"FEUILLES DE DIFF - MODE D'EMPLOI"]
[]
[null,null,null,"V1.0"]
[]
[null,"Cet onglet permet de vous expliquer chaque étape de cet outil. "]
{"$rows_left_out":44}
{"sheet":"MessageErreurO365","index":25,"n_rows":15,"n_cols":2,"rows_kept":15,"cut":false,"hidden":false,"merged":[[12,0,12,3]]}
["Si vous voyez le message suivant : "]
[]
[]
[]
[]
[]
{"$rows_left_out":10}
{"sheet":"fiche engagement","index":26,"n_rows":19,"n_cols":8,"rows_kept":19,"cut":false,"hidden":false,"merged":[[18,1,18,4],[8,0,8,1],[0,0,0,5],[1,0,1,5],[2,0,2,5],[4,0,4,5],[6,0,6,1],[6,2,6,3],[3,0,3,5],[5,0,5,5],[10,0,10,1],[15,0,15,1],[15,2,15,4],[17,1,17,4],[12,2,14,4]]}
["Fiche d'engagement Compétition TeamGym - SAISON 2024- 2025 V1.2"]
["ENGAGEMENT EN LIGNE "]
["Remplir une feuille par équipe de compétition et remplissez toutes les cases."]
["Les cases grises sont des listes déroulantes."]
["Les cases bleues sont des zones de texte à compléter"]
["Les cases roses sont remplies automatiquement"]
{"$rows_left_out":14}
{"sheet":"FED Dif Sol","index":27,"n_rows":17,"n_cols":49,"rows_kept":17,"cut":false,"hidden":false,"merged":[[7,42,7,44],[7,45,7,47],[8,30,8,32],[14,29,16,29],[0,10,1,12],[9,29,11,29],[4,29,6,29],[7,30,7,32],[7,33,7,35],[7,36,7,38],[7,39,7,41],[2,45,2,47],[3,30,3,32],[3,33,3,35],[3,36,3,38],[3,39,3,41],[3,42,3,44],[3,45,3,47],[2,30,2,32],[2,33,2,35],[2,36,2,38],[2,39,2,41],[2,42,2,44],[14,0,16,0],[12,13,12,15],[13,1,13,3],[13,4,13,6],[13,7,13,9],[13,10,13,12],[13,13,13,15],[12,1,12,3],[12,4,12,6],[12,7,12,9],[12,10,12,12],[9,0,11,0],[12,17,12,19],[7,1,7,3],[7,4,7,6],[7,7,7,9],[7,10,7,12],[7,13,7,15],[8,13,8,15],[7,17,7,20],[8,16,8,17],[8,18,8,20],[4,0,6,0],[8,1,8,3],[8,4,8,6],[8,7,8,9],[8,10,8,12],[3,1,3,3],[3,4,3,6],[3,7,3,9],[3,10,3,12],[3,13,3,15],[0,4,1,6],[0,7,1,7],[0,8,1,9],[1,17,1,19],[2,1,2,3],[2,4,2,6],[2,7,2,9],[2,10,2,12],[2,13,2,15],[0,14,0,15],[12,45,12,47],[8,33,8,35],[8,36,8,38],[8,39,8,41],[8,42,8,44],[8,45,8,47],[12,30,12,32],[12,33,12,35],[12,36,12,38],[12,39,12,41],[12,42,12,44],[13,45,13,47],[16,30,16,32],[16,33,16,35],[16,36,16,38],[16,39,16,41],[16,42,16,44],[16,45,16,47],[13,30,13,32],[13,33,13,35],[13,36,13,38],[13,39,13,41],[13,42,13,44],[17,45,17,47],[17,30,17,32],[17,33,17,35],[17,36,17,38],[17,39,17,41],[17,42,17,44]]}
[null,null,null,null,"NOMBRE DE GYM:",null,null,{"$f":"'fiche engagement'!C12","v":0},"Equipe:",null,{"$f":"CONCATENATE(INDEX('FFGym Clubs'!$D$3:$D$381,'fiche engagement'!H16),\" - Equipe N°\",'fiche engagement'!E11)","v":{"$error":"#VALUE!"}},null,null,null,"Somme des Diff"]
[null,null,null,null,null,null,null,null,null,null,null,null,null,null,{"$f":"SUM(Z5:AS6)+SUM(Z10:AS11)+SUM(Z15:AS16)+AC7+AG7+AK7+AO7+AS7+AS12+AO12+AK12+AG12+AC12+AC17+AG17+AK17+AO17+AS17","v":0},"Cumul de toutes les valeurs",{"$f":"'fiche engagement'!C9","v":0},"Exigences de composition"]
[null,"Formation",null,null,"Formation",null,null,"Formation",null,null,"Formation",null,null,"Formation",null,null,null,null,null,null,null,null,null,null,null,null,null,null,null,null,"Formation",null,null,null,"Formation",null,null,null,"Formation",null,null,null,"Formation",null,null,null,"Formation"]
[null,null,null,null,null,null,null,null,null,null,null,null,null,null,null,null,null,null,null,"Formations différentes  6 "]
["DIFF","SAUT","PIVOTS + EFORCE","MAINTIEN","SAUT","PIVOTS + EFORCE","MAINTIEN","SAUT","PIVOTS + EFORCE","MAINTIEN","SAUT","PIVOTS + EFORCE","MAINTIEN","SAUT","PIVOTS + EFORCE","MAINTIEN",null,null,null,null,null,null,null,null,null,null,null,null,null,"DIFF",{"$f":"IFERROR(RIGHT(LEFT(B5,2))/10,0)","v":0},{"$f":"IFERROR(RIGHT(LEFT(C5,3))/10,0)","v":0},{"$f":"IFERROR(IF(LEN(D5)=6,1,RIGHT(LEFT(D5,3))/10),0)","v":0},{"$f":"IFERROR(RIGHT(LEFT(E5,2))/10,0)","v":0},{"$f":"IFERROR(RIGHT(LEFT(F5,3))/10,0)","v":0},{"$f":"IFERROR(IF(LEN(G5)=6,1,RIGHT(LEFT(G5,3))/10),0)","v":0},{"$f":"IFERROR(RIGHT(LEFT(H5,2))/10,0)","v":0},{"$f":"IFERROR(RIGHT(LEFT(I5,3))/10,0)","v":0},{"$f":"IFERROR(IF(LEN(J5)=6,1,RIGHT(LEFT(J5,3))/10),0)","v":0},{"$f":"IFERROR(RIGHT(LEFT(K5,2))/10,0)","v":0},{"$f":"IFERROR(RIGHT(LEFT(L5,3))/10,0)","v":0},{"$f":"IFERROR(IF(LEN(M5)=6,1,RIGHT(LEFT(M5,3))/10),0)","v":0},{"$f":"IFERROR(RIGHT(LEFT(N5,2))/10,0)","v":0},{"$f":"IFERROR(RIGHT(LEFT(O5,3))/10,0)","v":0},{"$f":"IFERROR(IF(LEN(P5)=6,1,RIGHT(LEFT(P5,3))/10),0)","v":0},{"$f":"IFERROR(RIGHT(LEFT(Q5,2))/10,0)","v":0},{"$f":"IFERROR(RIGHT(LEFT(R5,3))/10,0)","v":0},{"$f":"IFERROR(IF(LEN(S5)=6,1,RIGHT(LEFT(S5,3))/10),0)","v":0}]
[null,"GE","TOUT","TOUT","GE","TOUT","TOUT","GE","TOUT","TOUT","GE","TOUT","TOUT","GE","TOUT","TOUT",null,null,null,null,null,null,null,null,null,null,null,null,null,null,{"$f":"IFERROR(RIGHT(LEFT(B6,2))/10,0)","v":0},{"$f":"IFERROR(IF(LEN(C6)=5,RIGHT(LEFT(C6,3))/10,RIGHT(LEFT(C6,2))/10),0)","v":0},{"$f":"IFERROR(IF(LEN(D6)=5,RIGHT(LEFT(D6,3))/10,RIGHT(LEFT(D6,2))/10),0)","v":0},0,{"$f":"IFERROR(IF(LEN(F6)=5,RIGHT(LEFT(F6,3))/10,RIGHT(LEFT(F6,2))/10),0)","v":0},0,0,{"$f":"IFERROR(IF(LEN(I6)=5,RIGHT(LEFT(I6,3))/10,RIGHT(LEFT(I6,2))/10),0)","v":0},0,0,{"$f":"IFERROR(IF(LEN(L6)=5,RIGHT(LEFT(L6,3))/10,RIGHT(LEFT(L6,2))/10),0)","v":0},0,0,{"$f":"IFERROR(IF(LEN(O6)=5,RIGHT(LEFT(O6,3))/10,RIGHT(LEFT(O6,2))/10),0)","v":0},0,0,{"$f":"IFERROR(IF(LEN(R6)=5,RIGHT(LEFT(R6,3))/10,RIGHT(LEFT(R6,2))/10),0)","v":0},0]
{"$rows_left_out":12}
{"sheet":"PERF Dif Sol","index":28,"n_rows":22,"n_cols":43,"rows_kept":22,"cut":false,"hidden":false,"merged":[[9,25,11,25],[12,26,12,29],[12,30,12,33],[14,25,16,25],[12,38,12,41],[13,26,13,29],[13,30,13,33],[13,34,13,37],[17,34,17,37],[12,34,12,37],[17,38,17,41],[18,26,18,29],[18,30,18,33],[18,34,18,37],[18,38,18,41],[13,38,13,41],[17,1,17,4],[18,1,18,4],[19,0,21,0],[17,26,17,29],[17,30,17,33],[17,5,17,8],[17,9,17,12],[17,13,17,16],[18,5,18,8],[18,9,18,12],[18,13,18,16],[8,38,8,41],[4,25,6,25],[7,26,7,29],[7,30,7,33],[7,34,7,37],[7,38,7,41],[8,26,8,29],[8,30,8,33],[8,34,8,37],[3,26,3,29],[3,30,3,33],[3,34,3,37],[3,38,3,41],[2,26,2,29],[2,30,2,33],[2,34,2,37],[2,38,2,41],[14,0,16,0],[12,1,12,4],[12,5,12,8],[12,9,12,12],[12,13,12,16],[13,1,13,4],[13,5,13,8],[13,9,13,12],[13,13,13,16],[9,0,11,0],[9,18,9,20],[7,1,7,4],[7,5,7,8],[7,9,7,12],[7,13,7,16],[8,19,8,21],[8,17,8,18],[7,18,7,20],[4,0,6,0],[8,1,8,4],[8,5,8,8],[8,9,8,12],[8,13,8,16],[3,1,3,4],[3,5,3,8],[3,9,3,12],[3,13,3,16],[1,18,1,20],[2,1,2,4],[2,5,2,8],[2,9,2,12],[2,13,2,16],[0,1,1,4],[0,7,1,8],[0,9,1,13],[0,14,0,15],[1,14,1,15],[0,5,1,5]]}
[null,"NOMBRE DE GYM:",null,null,null,{"$f":"'fiche engagement'!C12","v":0},null,"Equipe:",null,{"$f":"CONCATENATE(INDEX('FFGym Clubs'!$D$3:$D$381,'fiche engagement'!H16),\" - Equipe N°\",'fiche engagement'!E11)","v":{"$error":"#VALUE!"}},null,null,null,null,"Diff +DD",null,"Combi",{"$f":"O2+Q2","v":0.5}]
[null,null,null,null,null,null,null,null,null,null,null,null,null,null,{"$f":"0.5+SUM(AA5:AP6)+SUM(AA10:AP11)+SUM(AA15:AP16)+AD7+AH7+AL7+AP7+SUM(AA20:AP21)+AD22+AH22+AL22+AP22+AP12+AL12+AH12+AD12+AD17+AH17+AL17+AP17","v":0.5},null,{"$f":"MAX(AQ7,AQ12,AQ17,AQ22)","v":0},{"$f":"'fiche engagement'!C9","v":0},"Exigences de composition"]
[null,"Formation",null,null,null,"Formation",null,null,null,"Formation",null,null,null,"Formation",null,null,null,null,null,null,null,null,null,null,null,null,"Formation",null,null,null,"Formation",null,null,null,"Formation",null,null,null,"Formation"]
[null,null,null,null,null,null,null,null,null,null,null,null,null,null,null,null,null,null,null,null,"Formation 8"]
["DIFF","SAUT","PIVOTS + FORCE","MAINTIEN","ACRO","SAUT","PIVOTS + FORCE","MAINTIEN","ACRO","SAUT","PIVOTS + FORCE","MAINTIEN","ACRO","SAUT","PIVOTS + FORCE","MAINTIEN","ACRO",null,null,null,null,null,null,null,null,"DIFF",{"$f":"IFERROR(IF(LEN(B5)=6,1,IF(LEN(B5)=5,IF(OR(RIGHT(B5)=\"A\",RIGHT(B5)=\"B\"),RIGHT(LEFT(B5,2))/10,1),RIGHT(LEFT(B5,2))/10)),0)","v":0},{"$f":"IFERROR(IF(LEN(C5)=6,1,RIGHT(LEFT(C5,3))/10),0)","v":0},{"$f":"IFERROR(IF(LEN(D5)=6,1,RIGHT(LEFT(D5,3))/10),0)","v":0},{"$f":"IFERROR(IF(LEN(E5)=6,1,IF(LEN(E5)=5,IF(OR(RIGHT(E5)=\"A\",RIGHT(E5)=\"B\"),RIGHT(LEFT(E5,2))/10,1),RIGHT(LEFT(E5,2))/10)),0)","v":0},{"$f":"IFERROR(IF(LEN(F5)=6,1,IF(LEN(F5)=5,IF(OR(RIGHT(F5)=\"A\",RIGHT(F5)=\"B\"),RIGHT(LEFT(F5,2))/10,1),RIGHT(LEFT(F5,2))/10)),0)","v":0},{"$f":"IFERROR(IF(LEN(G5)=6,1,RIGHT(LEFT(G5,3))/10),0)","v":0},{"$f":"IFERROR(IF(LEN(H5)=6,1,RIGHT(LEFT(H5,3))/10),0)","v":0},{"$f":"IFERROR(IF(LEN(I5)=6,1,IF(LEN(I5)=5,IF(OR(RIGHT(I5)=\"A\",RIGHT(I5)=\"B\"),RIGHT(LEFT(I5,2))/10,1),RIGHT(LEFT(I5,2))/10)),0)","v":0},{"$f":"IFERROR(IF(LEN(J5)=6,1,IF(LEN(J5)=5,IF(OR(RIGHT(J5)=\"A\",RIGHT(J5)=\"B\"),RIGHT(LEFT(J5,2))/10,1),RIGHT(LEFT(J5,2))/10)),0)","v":0},{"$f":"IFERROR(IF(LEN(K5)=6,1,RIGHT(LEFT(K5,3))/10),0)","v":0},{"$f":"IFERROR(IF(LEN(L5)=6,1,RIGHT(LEFT(L5,3))/10),0)","v":0},{"$f":"IFERROR(IF(LEN(M5)=6,1,IF(LEN(M5)=5,IF(OR(RIGHT(M5)=\"A\",RIGHT(M5)=\"B\"),RIGHT(LEFT(M5,2))/10,1),RIGHT(LEFT(M5,2))/10)),0)","v":0},{"$f":"IFERROR(IF(LEN(N5)=6,1,IF(LEN(N5)=5,IF(OR(RIGHT(N5)=\"A\",RIGHT(N5)=\"B\"),RIGHT(LEFT(N5,2))/10,1),RIGHT(LEFT(N5,2))/10)),0)","v":0},{"$f":"IFERROR(IF(LEN(O5)=6,1,RIGHT(LEFT(O5,3))/10),0)","v":0},{"$f":"IFERROR(IF(LEN(P5)=6,1,RIGHT(LEFT(P5,3))/10),0)","v":0},{"$f":"IFERROR(IF(LEN(Q5)=6,1,IF(LEN(Q5)=5,IF(OR(RIGHT(Q5)=\"A\",RIGHT(Q5)=\"B\"),RIGHT(LEFT(Q5,2))/10,1),RIGHT(LEFT(Q5,2))/10)),0)","v":0}]
[null,"GE","SAUT","PIVOTS + FORCE","MAINTIEN","GE","SAUT","PIVOTS + FORCE","MAINTIEN","GE","SAUT","PIVOTS + FORCE","MAINTIEN","GE","SAUT","PIVOTS + FORCE","MAINTIEN",null,null,null,null,null,null,null,null,null,{"$f":"IFERROR(IF(LEN(B6)=5,1,RIGHT(LEFT(B6,2))/10),0)","v":0},{"$f":"IFERROR(IF(LEN(C6)=6,1,IF(LEN(C6)=5,IF(OR(RIGHT(C6)=\"A\",RIGHT(C6)=\"B\"),RIGHT(LEFT(C6,2))/10,1),RIGHT(LEFT(C6,2))/10)),0)","v":0},{"$f":"IFERROR(IF(LEN(D6)=6,1,RIGHT(LEFT(D6,3))/10),0)","v":0},{"$f":"IFERROR(IF(LEN(E6)=6,1,RIGHT(LEFT(E6,3))/10),0)","v":0},{"$f":"IFERROR(IF(LEN(F6)=5,1,RIGHT(LEFT(F6,2))/10),0)","v":0},{"$f":"IFERROR(IF(LEN(G6)=6,1,IF(LEN(G6)=5,IF(OR(RIGHT(G6)=\"A\",RIGHT(G6)=\"B\"),RIGHT(LEFT(G6,2))/10,1),RIGHT(LEFT(G6,2))/10)),0)","v":0},{"$f":"IFERROR(IF(LEN(H6)=6,1,RIGHT(LEFT(H6,3))/10),0)","v":0},{"$f":"IFERROR(IF(LEN(I6)=6,1,RIGHT(LEFT(I6,3))/10),0)","v":0},{"$f":"IFERROR(IF(LEN(J6)=5,1,RIGHT(LEFT(J6,2))/10),0)","v":0},{"$f":"IFERROR(IF(LEN(K6)=6,1,IF(LEN(K6)=5,IF(OR(RIGHT(K6)=\"A\",RIGHT(K6)=\"B\"),RIGHT(LEFT(K6,2))/10,1),RIGHT(LEFT(K6,2))/10)),0)","v":0},{"$f":"IFERROR(IF(LEN(L6)=6,1,RIGHT(LEFT(L6,3))/10),0)","v":0},{"$f":"IFERROR(IF(LEN(M6)=6,1,RIGHT(LEFT(M6,3))/10),0)","v":0},{"$f":"IFERROR(IF(LEN(N6)=5,1,RIGHT(LEFT(N6,2))/10),0)","v":0},{"$f":"IFERROR(IF(LEN(O6)=6,1,IF(LEN(O6)=5,IF(OR(RIGHT(O6)=\"A\",RIGHT(O6)=\"B\"),RIGHT(LEFT(O6,2))/10,1),RIGHT(LEFT(O6,2))/10)),0)","v":0},{"$f":"IFERROR(IF(LEN(P6)=6,1,RIGHT(LEFT(P6,3))/10),0)","v":0},{"$f":"IFERROR(IF(LEN(Q6)=6,1,RIGHT(LEFT(Q6,3))/10),0)","v":0}]
{"$rows_left_out":17}
{"sheet":"dif tumbling","index":29,"n_rows":41,"n_cols":14,"rows_kept":41,"cut":false,"hidden":false,"merged":[[34,2,34,9],[16,2,21,9],[25,2,25,9],[31,2,31,9],[28,2,28,9],[30,2,30,9],[0,1,0,2],[1,1,1,2],[2,1,2,2],[3,1,3,2],[4,1,4,2],[6,1,6,2],[7,1,7,2],[8,1,8,2],[29,2,29,9],[9,1,9,2],[39,2,39,9],[5,1,5,2],[40,2,40,9],[22,2,22,9],[10,1,10,2],[11,1,11,2],[12,1,12,2],[15,2,15,9],[26,2,26,9],[27,2,27,9],[13,2,13,10],[35,2,35,9],[36,2,36,9],[37,2,37,9],[38,2,38,9],[11,9,11,10]]}
[null,"Difficultés",null,"Nat A","Nat B","Nat C","Fed A/C","Fed B",null,null,null,"Case option pour les series avant arriere"]
["Av","Roulade avant",null,null,null,null,"0.3","0.5",null,null,null,1,2,1]
["Avt \nArr","Roue",null,null,"0.5","0.5","0.5",1]
["Arr","Roue pied pied",null,null,"0.5","0.5","0.5",1,null,null,null,{"$f":"'fiche engagement'!C9","v":0}]
["Arr","Rondade",null,null,"0.5","0.5",1,"1.5"]
["Avt","Saut de mains",null,"0.3",1,1,"1.5",2,null,"1/2 vrille",0.2]
{"$rows_left_out":36}
{"sheet":"dif mini tramp","index":30,"n_rows":41,"n_cols":14,"rows_kept":41,"cut":false,"hidden":false,"merged":[[28,2,28,9],[29,2,29,9],[38,2,38,9],[39,2,39,9],[30,2,30,9],[34,2,34,9],[35,2,35,9],[36,2,36,9],[37,2,37,9],[33,7,33,9],[33,2,33,6],[6,9,6,10],[26,2,26,9],[27,2,27,9],[16,2,21,9],[25,2,25,9],[12,9,12,10],[13,2,13,10],[15,2,15,9],[10,1,10,2],[11,1,11,2],[12,1,12,2],[9,1,9,2],[24,7,24,9],[24,2,24,6],[0,1,0,2],[5,1,5,2],[6,1,6,2],[7,1,7,2],[8,1,8,2]]}
[null,"Difficulté",null,"Nat A","Nat B","Nat C","Fed A/C","Fed B",null,null,null,"Case option pour les series avant arriere"]
[null,"Rondade",null,"0.5",1,1,null,null,null,null,null,1,2,2]
[null,"Rondade demi -Pétrick",null,"0.7","1.2"]
[null,"Lune",null,1,"1.6","1.6",null,null,null,null,null,{"$f":"'fiche engagement'!$C$9","v":0}]
[null,"Lune vrille",null,"1.4",2]
[null,"Tsukahara",null,"1.6"]
{"$rows_left_out":35}